Ticket #2839: madwifi-buildlog.txt

File madwifi-buildlog.txt, 17.2 KB (added by anonymous, 8 years ago)
Line 
1make[1]: Entering directory `/home/openwrt/builds/wl-500gp/trunk/brcm-2.4'
2make[2]: Entering directory `/home/openwrt/builds/wl-500gp/trunk/brcm-2.4/package/madwifi'
3rm -f /home/openwrt/builds/wl-500gp/trunk/brcm-2.4/bin/packages//kmod-madwifi_*
4rm -rf /home/openwrt/builds/wl-500gp/trunk/brcm-2.4/staging_dir/mipsel/usr/include/madwifi
5make[2]: Leaving directory `/home/openwrt/builds/wl-500gp/trunk/brcm-2.4/package/madwifi'
6make[1]: Leaving directory `/home/openwrt/builds/wl-500gp/trunk/brcm-2.4'
7make[1]: Entering directory `/home/openwrt/builds/wl-500gp/trunk/brcm-2.4'
8make[2]: Entering directory `/home/openwrt/builds/wl-500gp/trunk/brcm-2.4/package/wireless-tools'
9make[2]: Leaving directory `/home/openwrt/builds/wl-500gp/trunk/brcm-2.4/package/wireless-tools'
10make[2]: Entering directory `/home/openwrt/builds/wl-500gp/trunk/brcm-2.4/package/madwifi'
11gzip -dc /media/data/srv/ftp/sources/madwifi-dfs-r2996.tar.gz | /bin/tar -C /home/openwrt/builds/wl-500gp/trunk/brcm-2.4/build_dir/linux-brcm-2.4/madwifi-dfs-r2996/.. -xf -
12
13Applying ./patches/100-kernel_cflags.patch using plaintext:
14patching file hal/public/mips-be-elf.inc
15patching file hal/public/mips-le-elf.inc
16patching file hal/public/xscale-be-elf.inc
17
18Applying ./patches/102-multicall_binary.patch using plaintext:
19patching file tools/80211debug.c
20Hunk #2 succeeded at 187 (offset 3 lines).
21patching file tools/80211stats.c
22patching file tools/athchans.c
23patching file tools/athctrl.c
24patching file tools/athdebug.c
25Hunk #2 succeeded at 194 (offset 3 lines).
26patching file tools/athkey.c
27patching file tools/athstats.c
28patching file tools/do_multi.c
29patching file tools/do_multi.h
30patching file tools/Makefile
31patching file tools/wlanconfig.c
32patching file tools/ath_info.c
33
34Applying ./patches/104-autocreate_none.patch using plaintext:
35patching file ath/if_ath.c
36Hunk #1 succeeded at 512 (offset 86 lines).
37
38Applying ./patches/105-ratectl_attach.patch using plaintext:
39patching file net80211/ieee80211_rate.c
40
41Applying ./patches/111-minstrel_crash.patch using plaintext:
42patching file ath_rate/minstrel/minstrel.c
43
44Applying ./patches/113-no_ibss_pwrsave.patch using plaintext:
45patching file net80211/ieee80211_scan.c
46
47Applying ./patches/122-replayfail_workaround.patch using plaintext:
48patching file net80211/ieee80211_linux.c
49Hunk #1 succeeded at 331 (offset -2 lines).
50
51Applying ./patches/123-ccmp_checks.patch using plaintext:
52patching file net80211/ieee80211_crypto_ccmp.c
53
54Applying ./patches/124-linux24_compat.patch using plaintext:
55patching file ath/if_athvar.h
56
57Applying ./patches/126-rxerr_frames.patch using plaintext:
58patching file ath/if_ath.c
59Hunk #1 succeeded at 6370 with fuzz 2 (offset 536 lines).
60
61Applying ./patches/127-regaccess.patch using plaintext:
62patching file ath_hal/ah_os.h
63
64Applying ./patches/200-no_debug.patch using plaintext:
65patching file ath/if_ath.c
66Hunk #2 succeeded at 516 (offset 1 line).
67Hunk #3 succeeded at 1282 (offset -3 lines).
68Hunk #4 succeeded at 10281 (offset -13 lines).
69Hunk #5 succeeded at 10696 (offset -13 lines).
70patching file ath_rate/amrr/amrr.c
71patching file ath_rate/minstrel/minstrel.c
72patching file ath_rate/onoe/onoe.c
73patching file ath_rate/sample/sample.c
74patching file tools/do_multi.c
75patching file tools/Makefile
76patching file net80211/ieee80211_linux.h
77
78Applying ./patches/300-napi_polling.patch using plaintext:
79patching file ath/if_ath.c
80Hunk #2 succeeded at 535 (offset 1 line).
81Hunk #3 succeeded at 807 (offset 1 line).
82Hunk #4 succeeded at 2160 (offset -5 lines).
83Hunk #5 succeeded at 2213 (offset -5 lines).
84Hunk #6 succeeded at 2246 (offset -5 lines).
85Hunk #7 succeeded at 3938 (offset -5 lines).
86Hunk #8 succeeded at 3954 (offset -5 lines).
87Hunk #9 succeeded at 6261 (offset -5 lines).
88Hunk #10 succeeded at 6278 (offset -5 lines).
89Hunk #11 succeeded at 6306 (offset -5 lines).
90Hunk #12 succeeded at 6357 (offset -5 lines).
91Hunk #13 succeeded at 6556 (offset -13 lines).
92Hunk #14 succeeded at 8205 (offset -13 lines).
93Hunk #15 succeeded at 8237 (offset -13 lines).
94Hunk #16 succeeded at 8258 (offset -13 lines).
95Hunk #17 succeeded at 8285 (offset -13 lines).
96Hunk #18 succeeded at 8294 (offset -13 lines).
97Hunk #19 succeeded at 8378 (offset -13 lines).
98Hunk #20 succeeded at 10146 (offset -13 lines).
99patching file ath/if_athvar.h
100Hunk #2 succeeded at 730 (offset -1 lines).
101Hunk #3 succeeded at 742 (offset -1 lines).
102Hunk #4 succeeded at 855 (offset -1 lines).
103patching file net80211/ieee80211_input.c
104patching file net80211/ieee80211_monitor.c
105
106Applying ./patches/305-pureg_fix.patch using plaintext:
107patching file ath/if_ath.c
108Hunk #1 succeeded at 3993 with fuzz 2 (offset -5 lines).
109patching file net80211/ieee80211_input.c
110patching file net80211/ieee80211_node.c
111patching file net80211/ieee80211_proto.c
112patching file net80211/ieee80211_var.h
113
114Applying ./patches/309-micfail_detect.patch using plaintext:
115patching file ath/if_ath.c
116Hunk #1 succeeded at 6282 (offset 197 lines).
117Hunk #2 succeeded at 6379 (offset 197 lines).
118Hunk #3 succeeded at 6440 (offset 198 lines).
119Hunk #4 succeeded at 6450 (offset 198 lines).
120Hunk #5 succeeded at 6491 (offset 198 lines).
121patching file net80211/ieee80211_crypto_ccmp.c
122patching file net80211/ieee80211_crypto.h
123patching file net80211/ieee80211_crypto_none.c
124patching file net80211/ieee80211_crypto_tkip.c
125patching file net80211/ieee80211_crypto_wep.c
126patching file net80211/ieee80211_input.c
127Hunk #1 succeeded at 646 (offset 6 lines).
128Hunk #2 succeeded at 4168 (offset 356 lines).
129patching file net80211/ieee80211_proto.h
130patching file net80211/ieee80211_linux.c
131patching file net80211/ieee80211_output.c
132Hunk #1 succeeded at 1092 (offset -1 lines).
133patching file net80211/ieee80211_node.c
134Hunk #1 succeeded at 2236 (offset 71 lines).
135
136Applying ./patches/310-noise_get.patch using plaintext:
137patching file ath/if_ath.c
138Hunk #1 succeeded at 1652 with fuzz 2 (offset 55 lines).
139Hunk #2 succeeded at 8779 (offset 244 lines).
140Hunk #3 succeeded at 8834 (offset 244 lines).
141Hunk #4 succeeded at 9063 with fuzz 2 (offset 250 lines).
142touch /home/openwrt/builds/wl-500gp/trunk/brcm-2.4/build_dir/linux-brcm-2.4/madwifi-dfs-r2996/.prepared_871ec8790750745ebadebab1bc5035c1
143/home/openwrt/builds/wl-500gp/trunk/brcm-2.4/staging_dir/host/bin/sed -i -e 's,-E[LB] ,,g' /home/openwrt/builds/wl-500gp/trunk/brcm-2.4/build_dir/linux-brcm-2.4/madwifi-dfs-r2996/hal/public/*.inc
144touch /home/openwrt/builds/wl-500gp/trunk/brcm-2.4/build_dir/linux-brcm-2.4/madwifi-dfs-r2996/.configured
145COPTS="-DCONFIG_ATHEROS_RATE_DEFAULT='\"minstrel\"'"  make -C /home/openwrt/builds/wl-500gp/trunk/brcm-2.4/build_dir/linux-brcm-2.4/madwifi-dfs-r2996 PATH="/home/openwrt/builds/wl-500gp/trunk/brcm-2.4/staging_dir/toolchain-mipsel_gcc3.4.6/bin:/home/openwrt/builds/wl-500gp/trunk/brcm-2.4/staging_dir/host/bin:/home/openwrt/builds/wl-500gp/trunk/brcm-2.4/staging_dir/mipsel/usr/bin:/home/openwrt/builds/wl-500gp/trunk/brcm-2.4/staging_dir/toolchain-mipsel_gcc3.4.6/bin:/home/openwrt/builds/wl-500gp/trunk/brcm-2.4/staging_dir/host/bin:/home/openwrt/builds/wl-500gp/trunk/brcm-2.4/staging_dir/mipsel/usr/bin:/usr/local/bin:/usr/bin:/bin:/usr/games" ARCH="mips" CROSS_COMPILE="mipsel-linux-uclibc-" TARGET="mips-le-elf" TOOLPREFIX="mipsel-linux-uclibc-" TOOLPATH="mipsel-linux-uclibc-" KERNELPATH="/home/openwrt/builds/wl-500gp/trunk/brcm-2.4/build_dir/linux-brcm-2.4/linux-2.4.34" LDOPTS="--no-warn-mismatch " ATH_RATE="ath_rate/minstrel" WARNINGS="" DOMULTI=1 BUS="PCI" modules
146make[3]: Entering directory `/home/openwrt/builds/wl-500gp/trunk/brcm-2.4/build_dir/linux-brcm-2.4/madwifi-dfs-r2996'
147Checking requirements... ok.
148Checking kernel configuration... ok.
149for i in ./ath ./ath_hal ath_rate/minstrel ./net80211; do \
150                make -C $i || exit 1; \
151        done
152make[4]: Entering directory `/home/openwrt/builds/wl-500gp/trunk/brcm-2.4/build_dir/linux-brcm-2.4/madwifi-dfs-r2996/ath'
153make -C /home/openwrt/builds/wl-500gp/trunk/brcm-2.4/build_dir/linux-brcm-2.4/linux-2.4.34 SUBDIRS=/home/openwrt/builds/wl-500gp/trunk/brcm-2.4/build_dir/linux-brcm-2.4/madwifi-dfs-r2996/ath modules
154make[5]: Entering directory `/home/openwrt/builds/wl-500gp/trunk/brcm-2.4/build_dir/linux-brcm-2.4/linux-2.4.34'
155make -C  /home/openwrt/builds/wl-500gp/trunk/brcm-2.4/build_dir/linux-brcm-2.4/madwifi-dfs-r2996/ath CFLAGS="-D__KERNEL__ -I/home/openwrt/builds/wl-500gp/trunk/brcm-2.4/build_dir/linux-brcm-2.4/linux-2.4.34/include -Wall -Wstrict-prototypes -Wno-trigraphs -Os -fno-strict-aliasing -fno-common -fno-builtin-sprintf -fomit-frame-pointer   -funit-at-a-time -I /home/openwrt/builds/wl-500gp/trunk/brcm-2.4/build_dir/linux-brcm-2.4/linux-2.4.34/include/asm/gcc -G 0 -mno-abicalls -fno-pic -pipe  -finline-limit=100000 -mabi=32 -march=mips32 -Wa,-32 -Wa,-march=mips32 -Wa,-mips32 -Wa,--trap -DMODULE -mlong-calls -fno-common" MAKING_MODULES=1 modules
156make[6]: Entering directory `/home/openwrt/builds/wl-500gp/trunk/brcm-2.4/build_dir/linux-brcm-2.4/madwifi-dfs-r2996/ath'
157mipsel-linux-uclibc-gcc -D__KERNEL__ -I/home/openwrt/builds/wl-500gp/trunk/brcm-2.4/build_dir/linux-brcm-2.4/linux-2.4.34/include -Wall -Wstrict-prototypes -Wno-trigraphs -Os -fno-strict-aliasing -fno-common -fno-builtin-sprintf -fomit-frame-pointer   -funit-at-a-time -I /home/openwrt/builds/wl-500gp/trunk/brcm-2.4/build_dir/linux-brcm-2.4/linux-2.4.34/include/asm/gcc -G 0 -mno-abicalls -fno-pic -pipe  -finline-limit=100000 -mabi=32 -march=mips32 -Wa,-32 -Wa,-march=mips32 -Wa,-mips32 -Wa,--trap -DMODULE -mlong-calls -fno-common -include ./../include/compat.h -I./../include -I./.. -I./../ath_hal -I./../hal -I./../net80211 -DCONFIG_ATHEROS_RATE_DEFAULT='"minstrel"' -DTARGET='"mips-le-elf"' -DAH_BYTE_ORDER=AH_LITTLE_ENDIAN -G 0 -mno-abicalls -fno-pic -mips32 -Wa,--trap -fno-strict-aliasing -fno-common -fomit-frame-pointer -mlong-calls -DATH_SUPERG_FF=1 -DATH_SUPERG_DYNTURBO=1 -DATH_TURBO_SCAN=1 -DATH_SUPERG_XR=1 -DATH_CAP_TPC=1 -DATH_PCI -DDFS_DOMAIN_ETSI -DTARGET='"mips-le-elf"' -DAH_BYTE_ORDER=AH_LITTLE_ENDIAN -G 0 -mno-abicalls -fno-pic -mips32 -Wa,--trap -fno-strict-aliasing -fno-common -fomit-frame-pointer -mlong-calls -DATH_SUPERG_FF=1 -DATH_SUPERG_DYNTURBO=1 -DATH_TURBO_SCAN=1 -DATH_SUPERG_XR=1 -DATH_CAP_TPC=1 -DATH_PCI -DDFS_DOMAIN_ETSI -DTARGET='"mips-le-elf"' -DAH_BYTE_ORDER=AH_LITTLE_ENDIAN -G 0 -mno-abicalls -fno-pic -mips32 -Wa,--trap -fno-strict-aliasing -fno-common -fomit-frame-pointer -mlong-calls -DATH_SUPERG_FF=1 -DATH_SUPERG_DYNTURBO=1 -DATH_TURBO_SCAN=1 -DATH_SUPERG_XR=1 -DATH_CAP_TPC=1 -DOPT_AH_H=\"public/mips-le-elf.opt_ah.h\" -nostdinc -iwithprefix include -DKBUILD_BASENAME=if_ath  -DEXPORT_SYMTAB -c if_ath.c
158if_ath.c: In function `ath_suspend':
159if_ath.c:1545: warning: unused variable `sc'
160if_ath.c: In function `ath_resume':
161if_ath.c:1554: warning: unused variable `sc'
162if_ath.c: In function `ath_check_total_radio_silence_not_required':
163if_ath.c:1575: warning: unused variable `dev'
164if_ath.c: In function `ath_check_radio_silence_not_required':
165if_ath.c:1587: warning: unused variable `dev'
166if_ath.c: In function `ath_intr':
167if_ath.c:2175: warning: unused variable `hw_tsf'
168if_ath.c: In function `ath_stop_locked':
169if_ath.c:2521: warning: implicit declaration of function `preempt_disable'
170if_ath.c:2524: warning: implicit declaration of function `preempt_enable_no_resched'
171if_ath.c: In function `ath_key_update_begin':
172if_ath.c:3930: warning: unused variable `sc'
173if_ath.c: In function `ath_key_update_end':
174if_ath.c:3951: warning: unused variable `sc'
175if_ath.c: In function `ath_tx_draintxq':
176if_ath.c:8345: warning: unused variable `ah'
177if_ath.c: In function `ath_draintxq':
178if_ath.c:8389: warning: unused variable `npend'
179if_ath.c: In function `ath_interrupt_dfs_channel_check':
180if_ath.c:11630: warning: unused variable `dev'
181if_ath.c: In function `ath_radar_detected':
182if_ath.c:11664: warning: unused variable `dev'
183if_ath.c: At top level:
184if_ath.c:451: warning: 'ath_debug' defined but not used
185if_ath.c:463: warning: 'ieee80211_debug' defined but not used
186mipsel-linux-uclibc-gcc -D__KERNEL__ -I/home/openwrt/builds/wl-500gp/trunk/brcm-2.4/build_dir/linux-brcm-2.4/linux-2.4.34/include -Wall -Wstrict-prototypes -Wno-trigraphs -Os -fno-strict-aliasing -fno-common -fno-builtin-sprintf -fomit-frame-pointer   -funit-at-a-time -I /home/openwrt/builds/wl-500gp/trunk/brcm-2.4/build_dir/linux-brcm-2.4/linux-2.4.34/include/asm/gcc -G 0 -mno-abicalls -fno-pic -pipe  -finline-limit=100000 -mabi=32 -march=mips32 -Wa,-32 -Wa,-march=mips32 -Wa,-mips32 -Wa,--trap -DMODULE -mlong-calls -fno-common -include ./../include/compat.h -I./../include -I./.. -I./../ath_hal -I./../hal -I./../net80211 -DCONFIG_ATHEROS_RATE_DEFAULT='"minstrel"' -DTARGET='"mips-le-elf"' -DAH_BYTE_ORDER=AH_LITTLE_ENDIAN -G 0 -mno-abicalls -fno-pic -mips32 -Wa,--trap -fno-strict-aliasing -fno-common -fomit-frame-pointer -mlong-calls -DATH_SUPERG_FF=1 -DATH_SUPERG_DYNTURBO=1 -DATH_TURBO_SCAN=1 -DATH_SUPERG_XR=1 -DATH_CAP_TPC=1 -DATH_PCI -DDFS_DOMAIN_ETSI -DTARGET='"mips-le-elf"' -DAH_BYTE_ORDER=AH_LITTLE_ENDIAN -G 0 -mno-abicalls -fno-pic -mips32 -Wa,--trap -fno-strict-aliasing -fno-common -fomit-frame-pointer -mlong-calls -DATH_SUPERG_FF=1 -DATH_SUPERG_DYNTURBO=1 -DATH_TURBO_SCAN=1 -DATH_SUPERG_XR=1 -DATH_CAP_TPC=1 -DATH_PCI -DDFS_DOMAIN_ETSI -DTARGET='"mips-le-elf"' -DAH_BYTE_ORDER=AH_LITTLE_ENDIAN -G 0 -mno-abicalls -fno-pic -mips32 -Wa,--trap -fno-strict-aliasing -fno-common -fomit-frame-pointer -mlong-calls -DATH_SUPERG_FF=1 -DATH_SUPERG_DYNTURBO=1 -DATH_TURBO_SCAN=1 -DATH_SUPERG_XR=1 -DATH_CAP_TPC=1 -DOPT_AH_H=\"public/mips-le-elf.opt_ah.h\" -nostdinc -iwithprefix include -DKBUILD_BASENAME=if_ath_radar  -DEXPORT_SYMTAB -c if_ath_radar.c
187if_ath_radar.c: In function `rp_analyse':
188if_ath_radar.c:1302: warning: implicit declaration of function `list_for_each_entry_reverse'
189if_ath_radar.c:1302: error: `list' undeclared (first use in this function)
190if_ath_radar.c:1302: error: (Each undeclared identifier is reported only once
191if_ath_radar.c:1302: error: for each function it appears in.)
192if_ath_radar.c:1302: error: syntax error before '{' token
193if_ath_radar.c:1285: warning: unused variable `best_pattern'
194if_ath_radar.c: At top level:
195if_ath_radar.c:1414: error: syntax error before "if"
196if_ath_radar.c:1473: warning: type defaults to `int' in declaration of `best_pattern'
197if_ath_radar.c:1474: error: `best_index' undeclared here (not in a function)
198if_ath_radar.c:1474: warning: data definition has no type or storage class
199if_ath_radar.c:1475: error: syntax error before "do"
200if_ath_radar.c:1504: error: syntax error before numeric constant
201if_ath_radar.c:1504: warning: type defaults to `int' in declaration of `ath_rp_print'
202if_ath_radar.c:1504: warning: function declaration isn't a prototype
203if_ath_radar.c:1504: error: conflicting types for 'ath_rp_print'
204if_ath_radar.h:185: error: previous declaration of 'ath_rp_print' was here
205if_ath_radar.c:1504: error: conflicting types for 'ath_rp_print'
206if_ath_radar.h:185: error: previous declaration of 'ath_rp_print' was here
207if_ath_radar.c:1504: warning: data definition has no type or storage class
208if_ath_radar.c:1518: error: syntax error before '[' token
209if_ath_radar.c:1518: warning: type defaults to `int' in declaration of `ath_radar_detected'
210if_ath_radar.c:1518: warning: function declaration isn't a prototype
211if_ath_radar.c:1518: error: conflicting types for 'ath_radar_detected'
212./../ath/if_athvar.h:913: error: previous declaration of 'ath_radar_detected' was here
213if_ath_radar.c:1518: error: conflicting types for 'ath_radar_detected'
214./../ath/if_athvar.h:913: error: previous declaration of 'ath_radar_detected' was here
215if_ath_radar.c:1518: warning: data definition has no type or storage class
216if_ath_radar.c: In function `ath_rp_init':
217if_ath_radar.c:1552: warning: implicit declaration of function `kzalloc'
218if_ath_radar.c: At top level:
219if_ath_radar.c:1697: error: conflicting types for 'ath_rp_print'
220if_ath_radar.c:1504: error: previous declaration of 'ath_rp_print' was here
221if_ath_radar.c:1697: error: conflicting types for 'ath_rp_print'
222if_ath_radar.c:1504: error: previous declaration of 'ath_rp_print' was here
223if_ath_radar.c: In function `ath_rp_print':
224if_ath_radar.c:1709: error: `list' undeclared (first use in this function)
225if_ath_radar.c:1710: error: syntax error before "if"
226if_ath_radar.c:1713: error: syntax error before '{' token
227if_ath_radar.c: At top level:
228if_ath_radar.c:1732: error: syntax error before '}' token
229if_ath_radar.c: In function `ath_rp_flush':
230if_ath_radar.c:1737: error: `list' undeclared (first use in this function)
231if_ath_radar.c:1738: error: syntax error before "pulse"
232make[6]: *** [if_ath_radar.o] Error 1
233make[6]: Leaving directory `/home/openwrt/builds/wl-500gp/trunk/brcm-2.4/build_dir/linux-brcm-2.4/madwifi-dfs-r2996/ath'
234make[5]: *** [_mod_/home/openwrt/builds/wl-500gp/trunk/brcm-2.4/build_dir/linux-brcm-2.4/madwifi-dfs-r2996/ath] Error 2
235make[5]: Leaving directory `/home/openwrt/builds/wl-500gp/trunk/brcm-2.4/build_dir/linux-brcm-2.4/linux-2.4.34'
236make[4]: *** [all] Error 2
237make[4]: Leaving directory `/home/openwrt/builds/wl-500gp/trunk/brcm-2.4/build_dir/linux-brcm-2.4/madwifi-dfs-r2996/ath'
238make[3]: *** [modules] Error 1
239make[3]: Leaving directory `/home/openwrt/builds/wl-500gp/trunk/brcm-2.4/build_dir/linux-brcm-2.4/madwifi-dfs-r2996'
240make[2]: *** [/home/openwrt/builds/wl-500gp/trunk/brcm-2.4/build_dir/linux-brcm-2.4/madwifi-dfs-r2996/.built] Error 2
241make[2]: Leaving directory `/home/openwrt/builds/wl-500gp/trunk/brcm-2.4/package/madwifi'
242make[1]: *** [package/madwifi/compile] Error 2
243make[1]: Leaving directory `/home/openwrt/builds/wl-500gp/trunk/brcm-2.4'
244make: *** [package/madwifi-compile] Fehler 2