Modify

Opened 10 years ago

Closed 10 years ago

Last modified 22 months ago

#201 closed defect (fixed)

Alsa fails to build

Reported by: olli <olli@…> Owned by: nico
Priority: normal Milestone: Barrier Breaker 14.07
Component: kernel Version: 2.0
Keywords: Cc:

Description

Kamikaze [2907] fails while building Alsa.

make[12]: Leaving directory `/tmp/x86-2.6/build_i386/linux-2.6-x86/alsa-driver-1.0.10/pci/mixart'
make[12]: Entering directory `/tmp/x86-2.6/build_i386/linux-2.6-x86/alsa-driver-1.0.10/pci/nm256'
make[12]: Leaving directory `/tmp/x86-2.6/build_i386/linux-2.6-x86/alsa-driver-1.0.10/pci/nm256'
make[12]: Entering directory `/tmp/x86-2.6/build_i386/linux-2.6-x86/alsa-driver-1.0.10/pci/pcxhr'
make[12]: Leaving directory `/tmp/x86-2.6/build_i386/linux-2.6-x86/alsa-driver-1.0.10/pci/pcxhr'
make[12]: Entering directory `/tmp/x86-2.6/build_i386/linux-2.6-x86/alsa-driver-1.0.10/pci/pdplus'
make[12]: Leaving directory `/tmp/x86-2.6/build_i386/linux-2.6-x86/alsa-driver-1.0.10/pci/pdplus'
make[12]: Entering directory `/tmp/x86-2.6/build_i386/linux-2.6-x86/alsa-driver-1.0.10/pci/riptide'
make[12]: Leaving directory `/tmp/x86-2.6/build_i386/linux-2.6-x86/alsa-driver-1.0.10/pci/riptide'
make[12]: Entering directory `/tmp/x86-2.6/build_i386/linux-2.6-x86/alsa-driver-1.0.10/pci/rme9652'
make[12]: Leaving directory `/tmp/x86-2.6/build_i386/linux-2.6-x86/alsa-driver-1.0.10/pci/rme9652'
make[12]: Entering directory `/tmp/x86-2.6/build_i386/linux-2.6-x86/alsa-driver-1.0.10/pci/trident'
make[12]: Leaving directory `/tmp/x86-2.6/build_i386/linux-2.6-x86/alsa-driver-1.0.10/pci/trident'
make[12]: Entering directory `/tmp/x86-2.6/build_i386/linux-2.6-x86/alsa-driver-1.0.10/pci/vx222'
make[12]: Leaving directory `/tmp/x86-2.6/build_i386/linux-2.6-x86/alsa-driver-1.0.10/pci/vx222'
make[12]: Entering directory `/tmp/x86-2.6/build_i386/linux-2.6-x86/alsa-driver-1.0.10/pci/ymfpci'
make[12]: Leaving directory `/tmp/x86-2.6/build_i386/linux-2.6-x86/alsa-driver-1.0.10/pci/ymfpci'
make[11]: Leaving directory `/tmp/x86-2.6/build_i386/linux-2.6-x86/alsa-driver-1.0.10/pci'
make[11]: Entering directory `/tmp/x86-2.6/build_i386/linux-2.6-x86/alsa-driver-1.0.10/usb'
make[12]: Entering directory `/tmp/x86-2.6/build_i386/linux-2.6-x86/alsa-driver-1.0.10/usb/usx2y'
make[12]: Leaving directory `/tmp/x86-2.6/build_i386/linux-2.6-x86/alsa-driver-1.0.10/usb/usx2y'
make[11]: Leaving directory `/tmp/x86-2.6/build_i386/linux-2.6-x86/alsa-driver-1.0.10/usb'
make[11]: Entering directory `/tmp/x86-2.6/build_i386/linux-2.6-x86/alsa-driver-1.0.10/pcmcia'
make[12]: Entering directory `/tmp/x86-2.6/build_i386/linux-2.6-x86/alsa-driver-1.0.10/pcmcia/pdaudiocf'
make[12]: Leaving directory `/tmp/x86-2.6/build_i386/linux-2.6-x86/alsa-driver-1.0.10/pcmcia/pdaudiocf'
make[12]: Entering directory `/tmp/x86-2.6/build_i386/linux-2.6-x86/alsa-driver-1.0.10/pcmcia/vx'
make[12]: Leaving directory `/tmp/x86-2.6/build_i386/linux-2.6-x86/alsa-driver-1.0.10/pcmcia/vx'
make[11]: Leaving directory `/tmp/x86-2.6/build_i386/linux-2.6-x86/alsa-driver-1.0.10/pcmcia'
make[10]: Leaving directory `/tmp/x86-2.6/build_i386/linux-2.6-x86/alsa-driver-1.0.10'
make -C /tmp/x86-2.6/build_i386/linux-2.6-x86/linux-2.6.15 SUBDIRS=/tmp/x86-2.6/build_i386/linux-2.6-x86/alsa-driver-1.0.10 O=/tmp/x86-2.6/build_i386/linux-2.6-x86/linux-2.6.15 modules
make[10]: Entering directory `/tmp/x86-2.6/build_i386/linux-2.6-x86/linux-2.6.15'
  CC [M]  /tmp/x86-2.6/build_i386/linux-2.6-x86/alsa-driver-1.0.10/acore/hwdep.o
In file included from /tmp/x86-2.6/build_i386/linux-2.6-x86/alsa-driver-1.0.10/include/adriver.h:770,
                 from /tmp/x86-2.6/build_i386/linux-2.6-x86/alsa-driver-1.0.10/include/sound/driver.h:42,
                 from /tmp/x86-2.6/build_i386/linux-2.6-x86/alsa-driver-1.0.10/acore/hwdep.c:22:
include/linux/pci.h:393: error: parse error before numeric constant
make[13]: *** [/tmp/x86-2.6/build_i386/linux-2.6-x86/alsa-driver-1.0.10/acore/hwdep.o] Error 1
make[12]: *** [/tmp/x86-2.6/build_i386/linux-2.6-x86/alsa-driver-1.0.10/acore] Error 2
make[11]: *** [_module_/tmp/x86-2.6/build_i386/linux-2.6-x86/alsa-driver-1.0.10] Error 2
make[10]: *** [modules] Error 2
make[10]: Leaving directory `/tmp/x86-2.6/build_i386/linux-2.6-x86/linux-2.6.15'
make[9]: *** [compile] Error 2
make[9]: Leaving directory `/tmp/x86-2.6/build_i386/linux-2.6-x86/alsa-driver-1.0.10'
make[8]: *** [/tmp/x86-2.6/build_i386/linux-2.6-x86/alsa-driver-1.0.10/.built] Error 2
make[8]: Leaving directory `/tmp/x86-2.6/target/linux/package/alsa'
make[7]: *** [compile] Error 2
make[7]: Leaving directory `/tmp/x86-2.6/target/linux/package/alsa'
make[6]: *** [alsa-compile] Error 2
make[6]: Leaving directory `/tmp/x86-2.6/target/linux/package'
make[5]: *** [/tmp/x86-2.6/build_i386/stamp/.linux-compile] Error 2
make[5]: Leaving directory `/tmp/x86-2.6/target/linux/x86-2.6'
make[4]: *** [compile] Error 2
make[4]: Leaving directory `/tmp/x86-2.6/target/linux/x86-2.6'
make[3]: *** [2.6/x86-compile] Error 2
make[3]: Leaving directory `/tmp/x86-2.6/target/linux'
make[2]: *** [linux-compile] Error 2
make[2]: Leaving directory `/tmp/x86-2.6/target'
make[1]: *** [target/compile] Error 2
make[1]: Leaving directory `/tmp/x86-2.6'
make: *** [world] Error 2
oliver@ubuntu:/tmp/x86-2.6$

Attachments (0)

Change History (3)

comment:1 Changed 10 years ago by nico

  • Owner changed from developers to nico
  • Status changed from new to assigned

comment:2 Changed 10 years ago by nico

  • Resolution set to fixed
  • Status changed from assigned to closed

It was fixed by changeset:3001 in trunk.

Thanks!

comment:3 Changed 22 months ago by jow

  • Milestone changed from Attitude Adjustment 12.09 to Barrier Breaker 14.07

Milestone Attitude Adjustment 12.09 deleted

Add Comment

Modify Ticket

Action
as closed .
The resolution will be deleted. Next status will be 'reopened'.
Author


E-mail address and user name can be saved in the Preferences.

 
Note: See TracTickets for help on using tickets.