Modify

Opened 8 years ago

Closed 8 years ago

Last modified 2 years ago

#3333 closed defect (wontfix)

X86 target fails to compile

Reported by: anonymous Owned by: developers
Priority: normal Milestone: Barrier Breaker 14.07
Component: kernel Version:
Keywords: Cc:

Description

make[1]: Entering directory `/home/oliver/trunk'
make[2]: Entering directory `/home/oliver/trunk'
make[3]: Entering directory `/home/oliver/trunk/target/linux'
TARGET_BUILD=1 make -C x86 compile
make[4]: Entering directory `/home/oliver/trunk/target/linux/x86'
rm -f /home/oliver/trunk/build_dir/linux-x86_generic/linux-2.6.24.2/vmlinux /home/oliver/trunk/build_dir/linux-x86_generic/linux-2.6.24.2/System.map
make -C /home/oliver/trunk/build_dir/linux-x86_generic/linux-2.6.24.2 CROSS_COMPILE="i386-linux-uclibc-" ARCH="i386" KBUILD_HAVE_NLS=no CONFIG_SHELL="/bin/bash" CC="i386-linux-uclibc-gcc" modules
make[5]: Entering directory `/home/oliver/trunk/build_dir/linux-x86_generic/linux-2.6.24.2'
  CHK     include/linux/version.h
  CHK     include/linux/utsrelease.h
  CALL    scripts/checksyscalls.sh
  CC [M]  drivers/net/b44.o
drivers/net/b44.c: In function 'b44_get_invariants':
drivers/net/b44.c:2063: error: 'struct ssb_sprom' has no member named 'r1'
drivers/net/b44.c:2064: error: 'struct ssb_sprom' has no member named 'r1'
drivers/net/b44.c:2066: error: 'struct ssb_sprom' has no member named 'r1'
drivers/net/b44.c:2067: error: 'struct ssb_sprom' has no member named 'r1'
make[7]: *** [drivers/net/b44.o] Error 1
make[6]: *** [drivers/net] Error 2
make[5]: *** [drivers] Error 2
make[5]: Leaving directory `/home/oliver/trunk/build_dir/linux-x86_generic/linux-2.6.24.2'
make[4]: *** [/home/oliver/trunk/build_dir/linux-x86_generic/linux-2.6.24.2/.modules] Error 2
make[4]: Leaving directory `/home/oliver/trunk/target/linux/x86'
make[3]: *** [compile] Error 2
make[3]: Leaving directory `/home/oliver/trunk/target/linux'
make[2]: *** [target/linux/compile] Error 2
make[2]: Leaving directory `/home/oliver/trunk'
make[1]: *** [/home/oliver/trunk/staging_dir/i386/stamp/.target_compile] Error 2
make[1]: Leaving directory `/home/oliver/trunk'
make: *** [world] Fehler 2

Attachments (0)

Change History (4)

comment:1 Changed 8 years ago by nico

  • Resolution set to fixed
  • Status changed from new to closed

Fixed in [10838], thanks for reporting!

The b44 driver still needs fixing though :)

comment:2 follow-up: Changed 8 years ago by Wlanman

  • Resolution fixed deleted
  • Status changed from closed to reopened

b44 did build for broadcom-2.6 on latest trunk for me, but had no time to test it...
Is this error x86 specific?

TARGET_BUILD=1 make -C x86 compile
make[4]: Entering directory `/home/oliver/trunk/target/linux/x86'

comment:3 in reply to: ↑ 2 Changed 8 years ago by nico

  • Resolution set to wontfix
  • Status changed from reopened to closed

Replying to Wlanman:

Is this error x86 specific?

Is seems, check source:/trunk/package/kernel/modules/network.mk@10838#L699 (line 699).

comment:4 Changed 2 years ago by jow

  • Milestone changed from Attitude Adjustment 12.09 to Barrier Breaker 14.07

Milestone Attitude Adjustment 12.09 deleted

Add Comment

Modify Ticket

Action
as closed .
The resolution will be deleted. Next status will be 'reopened'.
Author


E-mail address and user name can be saved in the Preferences.

 
Note: See TracTickets for help on using tickets.