Modify

Opened 8 years ago

Closed 8 years ago

Last modified 7 years ago

#4010 closed defect (fixed)

SL3512 storm build error !

Reported by: xserver Owned by: developers
Priority: highest Milestone:
Component: base system Version:
Keywords: storm SL3512 Cc:

Description

CC [M] crypto/algapi.o

CC [M] crypto/cryptomgr.o
CC [M] drivers/net/ppp_generic.o
CC [M] drivers/net/ppp_async.o
CC [M] drivers/net/pppox.o
CC [M] net/packet/af_packet.o
CC [M] net/netfilter/x_tables.o
CC [M] net/netfilter/xt_tcpudp.o
CC [M] net/netfilter/xt_CLASSIFY.o
CC [M] net/netfilter/xt_DSCP.o
CC [M] net/netfilter/xt_MARK.o
CC [M] net/ipv4/netfilter/ip_tables.o
CC [M] net/ipv4/netfilter/iptable_filter.o
CC [M] net/ipv4/netfilter/iptable_mangle.o
CC [M] drivers/net/pppoe.o
CC [M] net/ipv4/netfilter/iptable_raw.o
CC [M] net/bridge/netfilter/ebtables.o
CC [M] net/bridge/netfilter/ebtable_broute.o
CC [M] net/bridge/netfilter/ebtable_filter.o
CC [M] net/bridge/netfilter/ebtable_nat.o
CC [M] net/bridge/netfilter/ebt_802_3.o
CC [M] net/sched/sch_cbq.o
CC [M] net/netfilter/xt_NFQUEUE.o
CC [M] net/ipv4/netfilter/ipt_iprange.o
CC [M] net/sched/sch_htb.o
CC [M] net/netfilter/xt_TRACE.o
CC [M] net/netfilter/xt_TARPIT.o
CC [M] net/bridge/netfilter/ebt_among.o
CC [M] drivers/net/pppol2tp.o
CC [M] drivers/net/slhc.o
CC [M] net/ipv4/netfilter/ipt_owner.o
CC [M] drivers/net/imq.o
LD [M] crypto/crypto_algapi.o
LD [M] crypto/crypto_hash.o
CC [M] net/bridge/netfilter/ebt_arp.o
CC [M] net/ipv4/netfilter/ipt_tos.o
CC [M] drivers/net/tun.o
CC [M] net/sched/sch_hfsc.o
CC [M] net/bridge/netfilter/ebt_ip.o

net/netfilter/xt_TARPIT.c: In function 'tarpit_tcp':
net/netfilter/xt_TARPIT.c:120: error: implicit declaration of function 'nf_conntrack_put'
net/netfilter/xt_TARPIT.c:120: error: 'struct sk_buff' has no member named 'nfct'
net/netfilter/xt_TARPIT.c:121: error: 'struct sk_buff' has no member named 'nfct'

CC [M] net/bridge/netfilter/ebt_limit.o
CC [M] net/sched/sch_red.o
CC [M] net/sched/sch_gred.o
CC [M] net/sched/sch_ingress.o

make[7]: * [net/netfilter/xt_TARPIT.o] Error 1
make[7]: * Waiting for unfinished jobs....

CC [M] net/bridge/netfilter/ebt_mark_m.o
CC [M] net/sched/sch_dsmark.o
CC [M] net/sched/sch_sfq.o
CC [M] net/sched/sch_esfq.o
CC [M] net/ipv4/netfilter/ipt_time.o
CC [M] net/ipv4/netfilter/ipt_recent.o
CC [M] net/bridge/netfilter/ebt_pkttype.o
CC [M] net/sched/sch_tbf.o
CC [M] net/sched/sch_teql.o
CC [M] net/bridge/netfilter/ebt_stp.o
CC [M] net/sched/sch_prio.o
CC [M] net/sched/sch_netem.o
CC [M] net/bridge/netfilter/ebt_vlan.o
CC [M] net/ipv4/netfilter/ipt_ecn.o

make[6]: * [net/netfilter] Error 2
make[6]: * Waiting for unfinished jobs....

CC [M] net/ipv4/netfilter/ipt_ttl.o
CC [M] net/sched/cls_u32.o
CC [M] net/sched/cls_route.o
CC [M] net/sched/cls_fw.o
CC [M] net/ipv4/netfilter/ipt_addrtype.o
CC [M] net/ipv4/netfilter/ipt_ipp2p.o
CC [M] net/sched/cls_tcindex.o
CC [M] net/bridge/netfilter/ebt_arpreply.o

In file included from net/sched/sch_esfq.c:53:
include/net/netfilter/nf_conntrack.h:99: error: field 'ct_general' has incomplete type
include/net/netfilter/nf_conntrack.h: In function 'nf_ct_get':
include/net/netfilter/nf_conntrack.h:179: error: 'const struct sk_buff' has no member named 'nfct'
include/net/netfilter/nf_conntrack.h: In function 'nf_ct_put':
include/net/netfilter/nf_conntrack.h:186: error: implicit declaration of function 'nf_conntrack_put'
include/net/netfilter/nf_conntrack.h: In function 'nf_ct_is_untracked':
include/net/netfilter/nf_conntrack.h:268: error: 'const struct sk_buff' has no member named 'nfct'
make[7]: * [net/sched/sch_esfq.o] Error 1
make[7]:
* Waiting for unfinished jobs....

CC [M] net/ipv4/netfilter/ipt_REJECT.o
CC [M] net/ipv4/netfilter/ipt_TOS.o
CC [M] net/bridge/netfilter/ebt_mark.o
CC [M] net/ipv4/netfilter/ipt_ECN.o
CC [M] net/ipv4/netfilter/ipt_IMQ.o
CC [M] net/bridge/netfilter/ebt_dnat.o
CC [M] net/bridge/netfilter/ebt_redirect.o
CC [M] net/ipv4/netfilter/ipt_TTL.o
CC [M] net/ipv4/netfilter/ipt_LOG.o
CC [M] net/bridge/netfilter/ebt_snat.o
CC [M] net/bridge/netfilter/ebt_ulog.o
CC [M] net/bridge/netfilter/ebt_log.o

make[6]: * [net/sched] Error 2
make[5]: * [net] Error 2
make[5]: Leaving directory `/home/wireless/openwrt/trunk/build_dir/linux-storm/linux-2.6.23.17'
make[4]:
* home/wireless/openwrt/trunk/build_dir/linux-storm/linux-2.6.23.17/.modules Error 2
make[4]: Leaving directory `/home/wireless/openwrt/trunk/target/linux/storm'
make[3]: * [compile] Error 2
make[3]: Leaving directory `/home/wireless/openwrt/trunk/target/linux'
make[2]:
* [target/linux/compile] Error 2
make[2]: Leaving directory `/home/wireless/openwrt/trunk'
make[1]: * home/wireless/openwrt/trunk/staging_dir/arm/stamp/.target_compile Error 2
make[1]: Leaving directory `/home/wireless/openwrt/trunk'
make:
* [world] Error 2

Attachments (0)

Change History (2)

comment:1 Changed 8 years ago by xserver

did a fresh svn up . De-selected all Kernel Modules Related to Netfilter. Disabled firewall, iptables, ebtables but still the undermentioned error :

In file included from net/sched/sch_esfq.c:53:
include/net/netfilter/nf_conntrack.h:99: error: field 'ct_general' has incomplete type
include/net/netfilter/nf_conntrack.h: In function 'nf_ct_get':
include/net/netfilter/nf_conntrack.h:179: error: 'const struct sk_buff' has no member named 'nfct'
include/net/netfilter/nf_conntrack.h: In function 'nf_ct_put':
include/net/netfilter/nf_conntrack.h:186: error: implicit declaration of function 'nf_conntrack_put'
include/net/netfilter/nf_conntrack.h: In function 'nf_ct_is_untracked':
include/net/netfilter/nf_conntrack.h:268: error: 'const struct sk_buff' has no member named 'nfct'
make[7]: * [net/sched/sch_esfq.o] Error 1
make[7]:
* Waiting for unfinished jobs....
make[6]: * [net/sched] Error 2
make[6]:
* Waiting for unfinished jobs....

LD [M] net/bridge/bridge.o

make[5]: * [net] Error 2
make[5]: Leaving directory `/home/wireless/openwrt/trunk/build_dir/linux-storm/linux-2.6.23.17'
make[4]: * home/wireless/openwrt/trunk/build_dir/linux-storm/linux-2.6.23.17/.modules Error 2
make[4]: Leaving directory `/home/wireless/openwrt/trunk/target/linux/storm'
make[3]:
* [compile] Error 2
make[3]: Leaving directory `/home/wireless/openwrt/trunk/target/linux'
make[2]: * [target/linux/compile] Error 2
make[2]: Leaving directory `/home/wireless/openwrt/trunk'
make[1]:
* home/wireless/openwrt/trunk/staging_dir/arm/stamp/.target_compile Error 2
make[1]: Leaving directory `/home/wireless/openwrt/trunk'
make: * [world] Error 2

comment:2 Changed 8 years ago by nico

  • Resolution set to fixed
  • Status changed from new to closed

Fixed in [12686]

Add Comment

Modify Ticket

Action
as closed .
The resolution will be deleted. Next status will be 'reopened'.
Author


E-mail address and user name can be saved in the Preferences.

 
Note: See TracTickets for help on using tickets.