Modify

Opened 8 years ago

Closed 8 years ago

#4012 closed defect (fixed)

xf86-video-geode r12616 build failure on x86 alix

Reported by: seniorr@… Owned by: lars
Priority: normal Milestone:
Component: packages Version:
Keywords: Cc:

Description

I just did a build-all packages or r12616 for x86 alix. This is one of the build failures. It couldn't find some include files:

/bin/sh ../libtool --tag=CC   --mode=compile i386-linux-uclibc-gcc -DHAVE_CONFIG_H -I. -I. -I.. -I../src/cim -I../src/gfx -I../src/panel -I../linux_v26   -I/aux2/src/openwrt/build/r12616/staging_dir/i386/
 i386-linux-uclibc-gcc -DHAVE_CONFIG_H -I. -I. -I.. -I../src/cim -I../src/gfx -I../src/panel -I../linux_v26 -I/aux2/src/openwrt/build/r12616/staging_dir/i386/usr/include -I/aux2/src/openwrt/build/r12616/s
In file included from geode_msr.c:7:
/aux2/src/openwrt/build/r12616/staging_dir/i386/usr/include/os.h:31:17: error: apr.h: No such file or directory
In file included from /aux2/src/openwrt/build/r12616/staging_dir/i386/usr/include/os.h:32,
                 from geode_msr.c:7:
/aux2/src/openwrt/build/r12616/staging_dir/i386/usr/include/ap_config.h:26:23: error: apr_hooks.h: No such file or directory
/aux2/src/openwrt/build/r12616/staging_dir/i386/usr/include/ap_config.h:27:32: error: apr_optional_hooks.h: No such file or directory
make[6]: *** [geode_msr.lo] Error 1
make[6]: Leaving directory `/aux2/src/openwrt/build/r12616/build_dir/i386/Xorg/xf86-video-geode-2.10.1/src'
make[5]: *** [all-recursive] Error 1
make[5]: Leaving directory `/aux2/src/openwrt/build/r12616/build_dir/i386/Xorg/xf86-video-geode-2.10.1'
make[4]: *** [all] Error 2
make[4]: Leaving directory `/aux2/src/openwrt/build/r12616/build_dir/i386/Xorg/xf86-video-geode-2.10.1'
make[3]: *** [/aux2/src/openwrt/build/r12616/build_dir/i386/Xorg/xf86-video-geode-2.10.1//.built] Error 2
make[3]: Leaving directory `/aux2/src/openwrt/packages/XOrg/driver/xf86-video-geode'
make[2]: *** [package/xf86-video-geode/compile] Error 2
make[2]: Leaving directory `/aux2/src/openwrt/build/r12616'
make[1]: *** [/aux2/src/openwrt/build/r12616/staging_dir/i386/stamp/.package_compile] Error 2
make[1]: Leaving directory `/aux2/src/openwrt/build/r12616'
make: *** [world] Error 2

Attachments (0)

Change History (2)

comment:1 Changed 8 years ago by lars

  • Owner changed from developers to lars

comment:2 Changed 8 years ago by nbd

  • Resolution set to fixed
  • Status changed from new to closed

fixed in r12758

Add Comment

Modify Ticket

Action
as closed .
The resolution will be deleted. Next status will be 'reopened'.
Author


E-mail address and user name can be saved in the Preferences.

 
Note: See TracTickets for help on using tickets.